{"text_format":"3","workbook":"xlsx","n_sheets":11,"sheets":["consignes","Renseignements","Menu","saisie ","Point","GrilleDesComptes","comptes","Banque","Compte Résultat","bilan previsionnel","Bilan Financier"],"not_rendered":{"images":10,"macros":1,"defined_names":19},"read":"whole","date_system":"1900"}

{"sheet":"consignes","index":0,"n_rows":21,"n_cols":7,"rows_kept":21,"hidden":true,"merged":[[2,1,3,6],[5,1,6,6],[7,1,8,6],[10,1,10,6],[11,1,12,6],[13,1,14,6],[15,1,15,6],[16,1,18,6]]}
[]
[]
[null,"* Cet outil permet de gérer une comptabilité de district comprenant un compte courant "]
[]
[null,"* Le compte de résultats et le bilan annuel se font automatiquement"]
[null,"* Une vérification en fonction des relevés bancaires (opération appelée \"rapprochement bancaire\" ) est proposée: \n    Lorsqu'une opération a été prise en compte par la banque,  inscrivez le numéro du relevé  dans la dernière colonne de droite (\"pointage\") . Inscrivez ensuite le solde indiqué par le relevé dans la case jaune de la feuille \"point\". Un message vous indique si vous êtes en accord avec la banque  ou la somme que vous devez rechercher . "]
[]
[null,"* Le point sur le résultat provisoire de l'exercice en cours et sur l 'état de trésorerie  est aussi disponible "]
[]
[null,"Particularités importantes: "]
{"$rows_left_out":12}
{"sheet":"Renseignements","index":1,"n_rows":14,"n_cols":3,"rows_kept":14,"hidden":true}
[]
[null,"Coordonnées obligatoires."]
[]
[null,"Nom du district :","districtX"]
[null,"Boite postal :","???"]
[null,"Adresse :","adresseX"]
[null,"Code Postal","74- - - "]
[null,"Ville :","VilleX"]
[null,"Nom de la banque :","Banque Y"]
[null,"N° compte bancaire","n° xxxxxxxxxxxxxxx"]
{"$rows_left_out":5}
{"sheet":"Menu","index":2,"n_rows":58,"n_cols":1,"rows_kept":58,"merged":[[2,4,2,5],[2,6,2,7],[16,6,22,7],[32,1,32,3]]}
{"$rows_empty":57}
[" "]

{"sheet":"saisie ","index":3,"n_rows":10,"n_cols":13,"rows_kept":10,"hidden":true,"merged":[[2,12,9,12],[9,8,9,9],[18,6,24,7]]}
[{"$nulls":3},"* SAISIR SUR LE COMPTE COURANT ",{"$nulls":4},{"$f":"IF(AND(F6>=700,I6>0),\"ERREUR il faut un crédit\",\"\")","v":""},{"$f":"IF(AND(F6<700,J6>0),IF(F6>0,\"ERREUR il faut un débit\",\"\"),\"\")","v":""}]
[{"$nulls":8},{"$f":"IF(F6>0,IF(F6<700,\"⇓⇓⇓⇓\",\"\"),\"\")","v":""},{"$f":"IF(F6>0,IF(F6>=700,\"⇓⇓⇓⇓\",\"\"),\"\")","v":"⇓⇓⇓⇓"}]
[{"$nulls":3},"N°de Pièce","Ref Bancaire","N°de compte","Libellé","Destinataire , Provenance , Objet","débit","crédit",null,null,{"$f":"IF(F6=0,\"ERREUR N° de compte non saisi\",\"\")","v":""}]
[null,null,"date"]
[]
[null,null,{"$f":"TODAY()","v":"2014-03-11"},null,null,{"$f":"INDEX(comptes!B2:B26,LOOKUP(comptes!C1,comptes!A2:A37))","v":748}]
[{"$nulls":8},"…..€","…..€"]
[]
[]
[{"$nulls":8},{"$f":"IF(AND(ISNUMBER(I6),ISNUMBER(J6)),\"Une seule entrée svp !\",\"\")","v":""}]
{"$rows_left_out":1}
{"sheet":"Point","index":4,"n_rows":11,"n_cols":4,"rows_kept":11,"hidden":true,"merged":[[5,3,5,4]]}
[null,"Situation au",{"$f":"TODAY()","v":"2014-03-11"}]
[null,"Solde du compte courant  donné par l'ordinateur ",{"$f":"Banque!D16","v":{"v":0,"d":"0.00 €"}}]
[null,"Solde des opérations pointées",{"$f":"ROUND(Banque!J6+Banque!M60-Banque!L60,2)","v":{"v":0,"d":"0.00 €"}}]
[null,"Inscrire dans la case jaune le solde  du compte courant donné par le relevé bancaire ",{"v":0,"d":"0.00 €"}]
[null,null,{"$f":"IF(C3-C4=0,\"BRAVO !\",\"\")","v":"BRAVO !"}]
[null,null,{"$f":"IF(C4-C3=0,\"\",\"ERREUR ! la différence à rechercher est de :\")","v":""},{"$f":"IF(C3-C4=0,\"\",ABS(C3-C4))","v":""}]
[]
[]
[]
[null,"Trésorerie disponible",{"$f":"C2+C8+C9","v":{"v":0,"d":"0.00 €"}}]
{"$rows_left_out":2}
{"sheet":"GrilleDesComptes","index":5,"n_rows":46,"n_cols":35,"rows_kept":46,"hidden":true}
[]
[{"$nulls":3},606,607,613,615,null,618,622,623,624,625,626,627,null,657,null,671,678,null,null,741,744,746,null,748,756,758,null,771,778]
[{"$nulls":3},"Fournitures administratives","Matériel et gros équipement","Location salle ou matériel","Entretien et réparation matériel",null,"Documentations brochures","Prestations de service Honoraires","Récompenses Cadeaux","Transport collectif des élèves","Déplacement animateurs,  réceptions","Frais postaux et télécommunication","Frais bancaires",null,"Subvention versée aux AS. Crédits d'animation",null,"Charges sur Tombola , calendriers","Autres charges exceptionnelles",null,null,"Collectivités territoriales","CNDS","UNSS DN SR SD , crédits animation",null,"Dons divers","Cotisations des AS","Participations des AS aux sorties ou activités ",null,"Ventes tombola , calendriers…","Autres produits exceptionnels"]
[]
[{"$nulls":3},{"$f":"IF(Banque!$E19=D$2,Banque!$I19+Banque!$H19,0)","v":{"v":0,"d":"0.00"}},{"$f":"IF(Banque!$E19=E$2,Banque!$I19+Banque!$H19,0)","v":{"v":0,"d":"0.00"}},{"$f":"IF(Banque!$E19=F$2,Banque!$I19+Banque!$H19,0)","v":{"v":0,"d":"0.00"}},{"$f":"IF(Banque!$E19=G$2,Banque!$I19+Banque!$H19,0)","v":{"v":0,"d":"0.00"}},null,{"$f":"IF(Banque!$E19=I$2,Banque!$I19+Banque!$H19,0)","v":{"v":0,"d":"0.00"}},{"$f":"IF(Banque!$E19=J$2,Banque!$I19+Banque!$H19,0)","v":{"v":0,"d":"0.00"}},{"$f":"IF(Banque!$E19=K$2,Banque!$I19+Banque!$H19,0)","v":{"v":0,"d":"0.00"}},{"$f":"IF(Banque!$E19=L$2,Banque!$I19+Banque!$H19,0)","v":{"v":0,"d":"0.00"}},{"$f":"IF(Banque!$E19=M$2,Banque!$I19+Banque!$H19,0)","v":{"v":0,"d":"0.00"}},{"$f":"IF(Banque!$E19=N$2,Banque!$I19+Banque!$H19,0)","v":{"v":0,"d":"0.00"}},{"$f":"IF(Banque!$E19=O$2,Banque!$I19+Banque!$H19,0)","v":{"v":0,"d":"0.00"}},null,{"$f":"IF(Banque!$E19=Q$2,Banque!$I19+Banque!$H19,0)","v":{"v":0,"d":"0.00"}},null,{"$f":"IF(Banque!$E19=S$2,Banque!$I19+Banque!$H19,0)","v":{"v":0,"d":"0.00"}},{"$f":"IF(Banque!$E19=T$2,Banque!$I19+Banque!$H19,0)","v":{"v":0,"d":"0.00"}},null,null,{"$f":"IF(Banque!$E19=W$2,Banque!$I19+Banque!$H19,0)","v":{"v":0,"d":"0.00"}},{"$f":"IF(Banque!$E19=X$2,Banque!$I19+Banque!$H19,0)","v":{"v":0,"d":"0.00"}},{"$f":"IF(Banque!$E19=Y$2,Banque!$I19+Banque!$H19,0)","v":{"v":0,"d":"0.00"}},null,{"$f":"IF(Banque!$E19=AA$2,Banque!$I19+Banque!$H19,0)","v":{"v":0,"d":"0.00"}},{"$f":"IF(Banque!$E19=AB$2,Banque!$I19+Banque!$H19,0)","v":{"v":0,"d":"0.00"}},{"$f":"IF(Banque!$E19=AC$2,Banque!$I19+Banque!$H19,0)","v":{"v":0,"d":"0.00"}},{"$f":"IF(Banque!$E19=AD$2,Banque!$I19+Banque!$H19,0)","v":{"v":0,"d":"0.00"}},{"$f":"IF(Banque!$E19=AE$2,Banque!$I19+Banque!$H19,0)","v":{"v":0,"d":"0.00"}},{"$f":"IF(Banque!$E19=AF$2,Banque!$I19+Banque!$H19,0)","v":{"v":0,"d":"0.00"}}]
[{"$nulls":3},{"$f":"IF(Banque!$E20=D$2,Banque!$I20+Banque!$H20,0)","v":{"v":0,"d":"0.00"}},{"$f":"IF(Banque!$E20=E$2,Banque!$I20+Banque!$H20,0)","v":{"v":0,"d":"0.00"}},{"$f":"IF(Banque!$E20=F$2,Banque!$I20+Banque!$H20,0)","v":{"v":0,"d":"0.00"}},{"$f":"IF(Banque!$E20=G$2,Banque!$I20+Banque!$H20,0)","v":{"v":0,"d":"0.00"}},null,{"$f":"IF(Banque!$E20=I$2,Banque!$I20+Banque!$H20,0)","v":{"v":0,"d":"0.00"}},{"$f":"IF(Banque!$E20=J$2,Banque!$I20+Banque!$H20,0)","v":{"v":0,"d":"0.00"}},{"$f":"IF(Banque!$E20=K$2,Banque!$I20+Banque!$H20,0)","v":{"v":0,"d":"0.00"}},{"$f":"IF(Banque!$E20=L$2,Banque!$I20+Banque!$H20,0)","v":{"v":0,"d":"0.00"}},{"$f":"IF(Banque!$E20=M$2,Banque!$I20+Banque!$H20,0)","v":{"v":0,"d":"0.00"}},{"$f":"IF(Banque!$E20=N$2,Banque!$I20+Banque!$H20,0)","v":{"v":0,"d":"0.00"}},{"$f":"IF(Banque!$E20=O$2,Banque!$I20+Banque!$H20,0)","v":{"v":0,"d":"0.00"}},null,{"$f":"IF(Banque!$E20=Q$2,Banque!$I20+Banque!$H20,0)","v":{"v":0,"d":"0.00"}},null,{"$f":"IF(Banque!$E20=S$2,Banque!$I20+Banque!$H20,0)","v":{"v":0,"d":"0.00"}},{"$f":"IF(Banque!$E20=T$2,Banque!$I20+Banque!$H20,0)","v":{"v":0,"d":"0.00"}},null,null,{"$f":"IF(Banque!$E20=W$2,Banque!$I20+Banque!$H20,0)","v":{"v":0,"d":"0.00"}},{"$f":"IF(Banque!$E20=X$2,Banque!$I20+Banque!$H20,0)","v":{"v":0,"d":"0.00"}},{"$f":"IF(Banque!$E20=Y$2,Banque!$I20+Banque!$H20,0)","v":{"v":0,"d":"0.00"}},null,{"$f":"IF(Banque!$E20=AA$2,Banque!$I20+Banque!$H20,0)","v":{"v":0,"d":"0.00"}},{"$f":"IF(Banque!$E20=AB$2,Banque!$I20+Banque!$H20,0)","v":{"v":0,"d":"0.00"}},{"$f":"IF(Banque!$E20=AC$2,Banque!$I20+Banque!$H20,0)","v":{"v":0,"d":"0.00"}},{"$f":"IF(Banque!$E20=AD$2,Banque!$I20+Banque!$H20,0)","v":{"v":0,"d":"0.00"}},{"$f":"IF(Banque!$E20=AE$2,Banque!$I20+Banque!$H20,0)","v":{"v":0,"d":"0.00"}},{"$f":"IF(Banque!$E20=AF$2,Banque!$I20+Banque!$H20,0)","v":{"v":0,"d":"0.00"}}]
[{"$nulls":3},{"$f":"IF(Banque!$E21=D$2,Banque!$I21+Banque!$H21,0)","v":{"v":0,"d":"0.00"}},{"$f":"IF(Banque!$E21=E$2,Banque!$I21+Banque!$H21,0)","v":{"v":0,"d":"0.00"}},{"$f":"IF(Banque!$E21=F$2,Banque!$I21+Banque!$H21,0)","v":{"v":0,"d":"0.00"}},{"$f":"IF(Banque!$E21=G$2,Banque!$I21+Banque!$H21,0)","v":{"v":0,"d":"0.00"}},null,{"$f":"IF(Banque!$E21=I$2,Banque!$I21+Banque!$H21,0)","v":{"v":0,"d":"0.00"}},{"$f":"IF(Banque!$E21=J$2,Banque!$I21+Banque!$H21,0)","v":{"v":0,"d":"0.00"}},{"$f":"IF(Banque!$E21=K$2,Banque!$I21+Banque!$H21,0)","v":{"v":0,"d":"0.00"}},{"$f":"IF(Banque!$E21=L$2,Banque!$I21+Banque!$H21,0)","v":{"v":0,"d":"0.00"}},{"$f":"IF(Banque!$E21=M$2,Banque!$I21+Banque!$H21,0)","v":{"v":0,"d":"0.00"}},{"$f":"IF(Banque!$E21=N$2,Banque!$I21+Banque!$H21,0)","v":{"v":0,"d":"0.00"}},{"$f":"IF(Banque!$E21=O$2,Banque!$I21+Banque!$H21,0)","v":{"v":0,"d":"0.00"}},null,{"$f":"IF(Banque!$E21=Q$2,Banque!$I21+Banque!$H21,0)","v":{"v":0,"d":"0.00"}},null,{"$f":"IF(Banque!$E21=S$2,Banque!$I21+Banque!$H21,0)","v":{"v":0,"d":"0.00"}},{"$f":"IF(Banque!$E21=T$2,Banque!$I21+Banque!$H21,0)","v":{"v":0,"d":"0.00"}},null,null,{"$f":"IF(Banque!$E21=W$2,Banque!$I21+Banque!$H21,0)","v":{"v":0,"d":"0.00"}},{"$f":"IF(Banque!$E21=X$2,Banque!$I21+Banque!$H21,0)","v":{"v":0,"d":"0.00"}},{"$f":"IF(Banque!$E21=Y$2,Banque!$I21+Banque!$H21,0)","v":{"v":0,"d":"0.00"}},null,{"$f":"IF(Banque!$E21=AA$2,Banque!$I21+Banque!$H21,0)","v":{"v":0,"d":"0.00"}},{"$f":"IF(Banque!$E21=AB$2,Banque!$I21+Banque!$H21,0)","v":{"v":0,"d":"0.00"}},{"$f":"IF(Banque!$E21=AC$2,Banque!$I21+Banque!$H21,0)","v":{"v":0,"d":"0.00"}},{"$f":"IF(Banque!$E21=AD$2,Banque!$I21+Banque!$H21,0)","v":{"v":0,"d":"0.00"}},{"$f":"IF(Banque!$E21=AE$2,Banque!$I21+Banque!$H21,0)","v":{"v":0,"d":"0.00"}},{"$f":"IF(Banque!$E21=AF$2,Banque!$I21+Banque!$H21,0)","v":{"v":0,"d":"0.00"}}]
[{"$nulls":3},{"$f":"IF(Banque!$E22=D$2,Banque!$I22+Banque!$H22,0)","v":{"v":0,"d":"0.00"}},{"$f":"IF(Banque!$E22=E$2,Banque!$I22+Banque!$H22,0)","v":{"v":0,"d":"0.00"}},{"$f":"IF(Banque!$E22=F$2,Banque!$I22+Banque!$H22,0)","v":{"v":0,"d":"0.00"}},{"$f":"IF(Banque!$E22=G$2,Banque!$I22+Banque!$H22,0)","v":{"v":0,"d":"0.00"}},null,{"$f":"IF(Banque!$E22=I$2,Banque!$I22+Banque!$H22,0)","v":{"v":0,"d":"0.00"}},{"$f":"IF(Banque!$E22=J$2,Banque!$I22+Banque!$H22,0)","v":{"v":0,"d":"0.00"}},{"$f":"IF(Banque!$E22=K$2,Banque!$I22+Banque!$H22,0)","v":{"v":0,"d":"0.00"}},{"$f":"IF(Banque!$E22=L$2,Banque!$I22+Banque!$H22,0)","v":{"v":0,"d":"0.00"}},{"$f":"IF(Banque!$E22=M$2,Banque!$I22+Banque!$H22,0)","v":{"v":0,"d":"0.00"}},{"$f":"IF(Banque!$E22=N$2,Banque!$I22+Banque!$H22,0)","v":{"v":0,"d":"0.00"}},{"$f":"IF(Banque!$E22=O$2,Banque!$I22+Banque!$H22,0)","v":{"v":0,"d":"0.00"}},null,{"$f":"IF(Banque!$E22=Q$2,Banque!$I22+Banque!$H22,0)","v":{"v":0,"d":"0.00"}},null,{"$f":"IF(Banque!$E22=S$2,Banque!$I22+Banque!$H22,0)","v":{"v":0,"d":"0.00"}},{"$f":"IF(Banque!$E22=T$2,Banque!$I22+Banque!$H22,0)","v":{"v":0,"d":"0.00"}},null,null,{"$f":"IF(Banque!$E22=W$2,Banque!$I22+Banque!$H22,0)","v":{"v":0,"d":"0.00"}},{"$f":"IF(Banque!$E22=X$2,Banque!$I22+Banque!$H22,0)","v":{"v":0,"d":"0.00"}},{"$f":"IF(Banque!$E22=Y$2,Banque!$I22+Banque!$H22,0)","v":{"v":0,"d":"0.00"}},null,{"$f":"IF(Banque!$E22=AA$2,Banque!$I22+Banque!$H22,0)","v":{"v":0,"d":"0.00"}},{"$f":"IF(Banque!$E22=AB$2,Banque!$I22+Banque!$H22,0)","v":{"v":0,"d":"0.00"}},{"$f":"IF(Banque!$E22=AC$2,Banque!$I22+Banque!$H22,0)","v":{"v":0,"d":"0.00"}},{"$f":"IF(Banque!$E22=AD$2,Banque!$I22+Banque!$H22,0)","v":{"v":0,"d":"0.00"}},{"$f":"IF(Banque!$E22=AE$2,Banque!$I22+Banque!$H22,0)","v":{"v":0,"d":"0.00"}},{"$f":"IF(Banque!$E22=AF$2,Banque!$I22+Banque!$H22,0)","v":{"v":0,"d":"0.00"}}]
[{"$nulls":3},{"$f":"IF(Banque!$E23=D$2,Banque!$I23+Banque!$H23,0)","v":{"v":0,"d":"0.00"}},{"$f":"IF(Banque!$E23=E$2,Banque!$I23+Banque!$H23,0)","v":{"v":0,"d":"0.00"}},{"$f":"IF(Banque!$E23=F$2,Banque!$I23+Banque!$H23,0)","v":{"v":0,"d":"0.00"}},{"$f":"IF(Banque!$E23=G$2,Banque!$I23+Banque!$H23,0)","v":{"v":0,"d":"0.00"}},null,{"$f":"IF(Banque!$E23=I$2,Banque!$I23+Banque!$H23,0)","v":{"v":0,"d":"0.00"}},{"$f":"IF(Banque!$E23=J$2,Banque!$I23+Banque!$H23,0)","v":{"v":0,"d":"0.00"}},{"$f":"IF(Banque!$E23=K$2,Banque!$I23+Banque!$H23,0)","v":{"v":0,"d":"0.00"}},{"$f":"IF(Banque!$E23=L$2,Banque!$I23+Banque!$H23,0)","v":{"v":0,"d":"0.00"}},{"$f":"IF(Banque!$E23=M$2,Banque!$I23+Banque!$H23,0)","v":{"v":0,"d":"0.00"}},{"$f":"IF(Banque!$E23=N$2,Banque!$I23+Banque!$H23,0)","v":{"v":0,"d":"0.00"}},{"$f":"IF(Banque!$E23=O$2,Banque!$I23+Banque!$H23,0)","v":{"v":0,"d":"0.00"}},null,{"$f":"IF(Banque!$E23=Q$2,Banque!$I23+Banque!$H23,0)","v":{"v":0,"d":"0.00"}},null,{"$f":"IF(Banque!$E23=S$2,Banque!$I23+Banque!$H23,0)","v":{"v":0,"d":"0.00"}},{"$f":"IF(Banque!$E23=T$2,Banque!$I23+Banque!$H23,0)","v":{"v":0,"d":"0.00"}},null,null,{"$f":"IF(Banque!$E23=W$2,Banque!$I23+Banque!$H23,0)","v":{"v":0,"d":"0.00"}},{"$f":"IF(Banque!$E23=X$2,Banque!$I23+Banque!$H23,0)","v":{"v":0,"d":"0.00"}},{"$f":"IF(Banque!$E23=Y$2,Banque!$I23+Banque!$H23,0)","v":{"v":0,"d":"0.00"}},null,{"$f":"IF(Banque!$E23=AA$2,Banque!$I23+Banque!$H23,0)","v":{"v":0,"d":"0.00"}},{"$f":"IF(Banque!$E23=AB$2,Banque!$I23+Banque!$H23,0)","v":{"v":0,"d":"0.00"}},{"$f":"IF(Banque!$E23=AC$2,Banque!$I23+Banque!$H23,0)","v":{"v":0,"d":"0.00"}},{"$f":"IF(Banque!$E23=AD$2,Banque!$I23+Banque!$H23,0)","v":{"v":0,"d":"0.00"}},{"$f":"IF(Banque!$E23=AE$2,Banque!$I23+Banque!$H23,0)","v":{"v":0,"d":"0.00"}},{"$f":"IF(Banque!$E23=AF$2,Banque!$I23+Banque!$H23,0)","v":{"v":0,"d":"0.00"}}]
[{"$nulls":3},{"$f":"IF(Banque!$E24=D$2,Banque!$I24+Banque!$H24,0)","v":{"v":0,"d":"0.00"}},{"$f":"IF(Banque!$E24=E$2,Banque!$I24+Banque!$H24,0)","v":{"v":0,"d":"0.00"}},{"$f":"IF(Banque!$E24=F$2,Banque!$I24+Banque!$H24,0)","v":{"v":0,"d":"0.00"}},{"$f":"IF(Banque!$E24=G$2,Banque!$I24+Banque!$H24,0)","v":{"v":0,"d":"0.00"}},null,{"$f":"IF(Banque!$E24=I$2,Banque!$I24+Banque!$H24,0)","v":{"v":0,"d":"0.00"}},{"$f":"IF(Banque!$E24=J$2,Banque!$I24+Banque!$H24,0)","v":{"v":0,"d":"0.00"}},{"$f":"IF(Banque!$E24=K$2,Banque!$I24+Banque!$H24,0)","v":{"v":0,"d":"0.00"}},{"$f":"IF(Banque!$E24=L$2,Banque!$I24+Banque!$H24,0)","v":{"v":0,"d":"0.00"}},{"$f":"IF(Banque!$E24=M$2,Banque!$I24+Banque!$H24,0)","v":{"v":0,"d":"0.00"}},{"$f":"IF(Banque!$E24=N$2,Banque!$I24+Banque!$H24,0)","v":{"v":0,"d":"0.00"}},{"$f":"IF(Banque!$E24=O$2,Banque!$I24+Banque!$H24,0)","v":{"v":0,"d":"0.00"}},null,{"$f":"IF(Banque!$E24=Q$2,Banque!$I24+Banque!$H24,0)","v":{"v":0,"d":"0.00"}},null,{"$f":"IF(Banque!$E24=S$2,Banque!$I24+Banque!$H24,0)","v":{"v":0,"d":"0.00"}},{"$f":"IF(Banque!$E24=T$2,Banque!$I24+Banque!$H24,0)","v":{"v":0,"d":"0.00"}},null,null,{"$f":"IF(Banque!$E24=W$2,Banque!$I24+Banque!$H24,0)","v":{"v":0,"d":"0.00"}},{"$f":"IF(Banque!$E24=X$2,Banque!$I24+Banque!$H24,0)","v":{"v":0,"d":"0.00"}},{"$f":"IF(Banque!$E24=Y$2,Banque!$I24+Banque!$H24,0)","v":{"v":0,"d":"0.00"}},null,{"$f":"IF(Banque!$E24=AA$2,Banque!$I24+Banque!$H24,0)","v":{"v":0,"d":"0.00"}},{"$f":"IF(Banque!$E24=AB$2,Banque!$I24+Banque!$H24,0)","v":{"v":0,"d":"0.00"}},{"$f":"IF(Banque!$E24=AC$2,Banque!$I24+Banque!$H24,0)","v":{"v":0,"d":"0.00"}},{"$f":"IF(Banque!$E24=AD$2,Banque!$I24+Banque!$H24,0)","v":{"v":0,"d":"0.00"}},{"$f":"IF(Banque!$E24=AE$2,Banque!$I24+Banque!$H24,0)","v":{"v":0,"d":"0.00"}},{"$f":"IF(Banque!$E24=AF$2,Banque!$I24+Banque!$H24,0)","v":{"v":0,"d":"0.00"}}]
{"$rows_left_out":37}
{"sheet":"comptes","index":6,"n_rows":37,"n_cols":3,"rows_kept":37,"hidden":true}
[null,null,21]
[1,null,"DEPENSES"]
[2,606,"606 Fournitures administratives"]
[3,607,"607 Matériel et gros équipement"]
[4,613,"613 Location salle ou matériel"]
[5,615,"615 Entretien et réparation matériel"]
[6,618,"618 Documentations brochures"]
[7,622,"622 Prestations de service Honoraires"]
[8,623,"623 Récompenses Cadeaux"]
[9,624,"624 Transport collectif des élèves"]
{"$rows_left_out":28}
{"sheet":"Banque","index":7,"n_rows":60,"n_cols":13,"rows_kept":60,"hidden":true,"merged":[[0,3,0,4],[0,8,0,10],[2,1,2,5],[2,9,2,10],[3,1,4,1],[3,2,4,2],[3,3,4,3],[3,4,4,4],[3,5,4,5],[3,6,4,6],[3,7,4,7],[3,8,4,8],[3,9,4,9],[3,10,5,10],[5,5,5,6],[15,1,16,2],[15,3,16,3],[15,4,16,4],[17,5,17,6]]}
[null,{"$f":"\"Compte n° \"&'Bilan Financier'!C13","v":"Compte n° 5100"},null,{"$f":"Renseignements!C9","v":"Banque Y"},null,{"$f":"Renseignements!C10","v":"n° xxxxxxxxxxxxxxx"},null,null,"DEPENSES ET RECETTES"]
[]
[null,{"$f":"\"District : \"&Renseignements!C4&\" - \"&IF(ISBLANK(Renseignements!C5),\"\",\"BP \"&Renseignements!C5)&\" - \"&Renseignements!C6&\" - \"&Renseignements!C7&\" \"&Renseignements!C8","v":"District : districtX - BP ??? - adresseX - 74- - -  VilleX"},{"$nulls":4},"Edition du ",{"$f":"NOW()","v":"2014-03-11T10:18:11.860"},"ANNEE :",{"$f":"Renseignements!C11","v":"2013/2014"}]
[null,"Date","N° Pièce","Ref bancaire","N° de compte","Libellé du compte","Destinataire , Provenance , Objet","Dépenses\n-","Recettes\n+","Solde","Pointage\nInscrire le N°\ndu bordereau"]
[]
[{"$nulls":5},"Report du solde banque du dernier bordereau de l' année antérieure",{"$nulls":3},{"$f":"Renseignements!C14","v":{"v":0,"d":"0.00 €"}},null,"dépenses pointées","recettes pointées"]
[{"$nulls":5},"Ecriture année ant. non passée en banque",{"$nulls":3},{"$f":"IF(ISBLANK(G7),\"\",J6+I7-H7)","v":""},null,{"$f":"IF(ISBLANK(K7),0,H7)","v":0},{"$f":"IF(ISBLANK(K7),0,I7)","v":0}]
[{"$nulls":5},"Ecriture année ant. non passée en banque",{"$nulls":3},{"$f":"IF(ISBLANK(G8),\"\",J7+I8-H8)","v":""},null,0,0]
[{"$nulls":5},"Ecriture année ant. non passée en banque",{"$nulls":3},"",null,0,0]
[{"$nulls":5},"Ecriture année ant. non passée en banque",{"$nulls":3},"",null,0,0]
{"$rows_left_out":51}
{"sheet":"Compte Résultat","index":8,"n_rows":59,"n_cols":13,"rows_kept":59,"hidden":true,"merged":[[1,7,1,9],[2,7,2,9],[3,7,3,9],[4,7,4,9],[5,7,5,9],[8,2,8,5],[8,6,8,9],[10,2,10,5],[10,6,10,9],[14,7,17,7],[21,3,31,3],[28,7,31,7],[32,7,33,7],[34,3,37,3],[35,7,37,7],[41,3,44,3],[41,7,44,7],[51,6,54,9],[58,3,59,9]]}
[]
[{"$nulls":7},"District"]
[{"$nulls":7},{"$f":"Renseignements!C4","v":"districtX"}]
[{"$nulls":7},{"$f":"IF(ISBLANK(Renseignements!C5),\"\",\"BP \"&Renseignements!C5)","v":"BP ???"}]
[{"$nulls":7},{"$f":"Renseignements!C6","v":"adresseX"}]
[{"$nulls":7},{"$f":"Renseignements!C7&\" \"&Renseignements!C8","v":"74- - -  VilleX"}]
[]
[]
[null,null,"COMPTE DE RESULTAT ANNEE :",{"$nulls":3},{"$f":"Renseignements!C11","v":"2013/2014"}]
[]
{"$rows_left_out":50}
{"sheet":"bilan previsionnel","index":9,"n_rows":59,"n_cols":13,"rows_kept":59,"hidden":true,"merged":[[1,7,1,9],[2,7,2,9],[3,7,3,9],[4,7,4,9],[5,7,5,9],[8,2,8,5],[8,6,8,9],[10,2,10,5],[10,6,10,9],[14,7,17,7],[21,3,31,3],[28,7,31,7],[32,7,33,7],[34,3,37,3],[35,7,37,7],[41,3,44,3],[41,7,44,7],[51,6,54,9],[58,3,59,9]]}
[]
[{"$nulls":7},"District"]
[{"$nulls":7},{"$f":"Renseignements!C4","v":"districtX"}]
[{"$nulls":7},{"$f":"IF(ISBLANK(Renseignements!C5),\"\",\"BP \"&Renseignements!C5)","v":"BP ???"}]
[{"$nulls":7},{"$f":"Renseignements!C6","v":"adresseX"}]
[{"$nulls":7},{"$f":"Renseignements!C7&\" \"&Renseignements!C8","v":"74- - -  VilleX"}]
[]
[]
[null,null,"Bilan Prévisionnel :",{"$nulls":3},{"$f":"Renseignements!C11","v":"2013/2014"}]
[]
{"$rows_left_out":50}
{"sheet":"Bilan Financier","index":10,"n_rows":23,"n_cols":9,"rows_kept":23,"hidden":true,"merged":[[1,7,1,9],[2,7,2,9],[3,7,3,9],[4,7,4,9],[5,7,5,9],[6,3,6,5],[8,2,8,5],[8,6,8,8],[10,2,10,4],[10,6,10,8]]}
[]
[{"$nulls":7},"district"]
[{"$nulls":7},{"$f":"Renseignements!C4","v":"districtX"}]
[{"$nulls":7},{"$f":"IF(ISBLANK(Renseignements!C5),\"\",\"BP \"&Renseignements!C5)","v":"BP ???"}]
[{"$nulls":7},{"$f":"Renseignements!C6","v":"adresseX"}]
[{"$nulls":7},{"$f":"Renseignements!C7&\" \"&Renseignements!C8","v":"74- - -  VilleX"}]
[{"$nulls":3},{"$f":"IF(E17=I17,\"\",\"ERREUR !!\")","v":""}]
[]
[null,null,"BILAN FINANCIER ANNEE :",{"$nulls":3},{"$f":"Renseignements!C11","v":"2013/2014"}]
[]
{"$rows_left_out":13}