{"text_format":"3","workbook":"xlsx","n_sheets":12,"sheets":["consignes","Renseignements","Menu","saisie ","Point","GrilleDesComptes","comptes","Banque","Caisse","LivretEpargne","Compte-Résultat","Bilan-Financier"],"not_rendered":{"images":12,"macros":1,"defined_names":23},"read":"whole","date_system":"1900"}

{"sheet":"consignes","index":0,"n_rows":25,"n_cols":5,"rows_kept":25,"hidden":true,"merged":[[2,1,3,6],[5,1,6,6],[7,1,8,6],[10,1,11,6],[12,1,13,6],[14,1,14,6],[15,1,16,6],[17,1,18,6],[19,1,19,6],[20,1,20,6]]}
[]
[]
[null,"* Cet outil permet de gérer une comptabilité d'AS comprenant un compte courant , un livret d'épargne et une caisse "]
[]
[null,"* Le compte de résultats et le bilan annuel se font automatiquement"]
[null,"* Une vérification en fonction des relevés bancaires (opération appelée \"rapprochement bancaire\" ) est proposée: \n    Lorsqu'une opération a été prise en compte par la banque,  inscrivez le numéro du relevé  dans la dernière colonne de droite (\"pointage\") . Inscrivez ensuite le solde indiqué par le relevé dans la case jaune de la feuille \"point\". Un message vous indique si vous êtes en accord avec la banque  ou la somme que vous devez rechercher . "]
[]
[null,"* Le point sur le résultat provisoire de l'exercice en cours et sur l 'état de trésorerie  est aussi disponible "]
{"$rows_left_out":18}
{"sheet":"Renseignements","index":1,"n_rows":15,"n_cols":3,"rows_kept":15,"hidden":true}
[]
[null,"Coordonnées obligatoires."]
[]
[null,"Nom de l'établissement :","College X"]
[null,"Boite postal :","???"]
[null,"Adresse :","adresseX"]
[null,"Code Postal","74- - - "]
[null,"Ville :","VilleX"]
{"$rows_left_out":8}
{"sheet":"Menu","index":2,"n_rows":58,"n_cols":1,"rows_kept":58,"merged":[[2,4,2,5],[2,6,2,7],[16,6,22,7],[32,1,32,3]]}
{"$rows_empty":57}
[" "]

{"sheet":"saisie ","index":3,"n_rows":29,"n_cols":13,"rows_kept":29,"hidden":true,"merged":[[2,12,9,12],[9,8,9,9],[22,8,22,9],[28,8,28,9],[35,6,41,7]]}
[{"$nulls":3},"* SAISIR SUR LE COMPTE COURANT ",{"$nulls":4},{"$f":"IF(AND(F6>=700,I6>0),\"ERREUR il faut un crédit\",\"\")","v":""},{"$f":"IF(AND(F6<700,J6>0),IF(F6>0,\"ERREUR il faut un débit\",\"\"),\"\")","v":""}]
[{"$nulls":8},{"$f":"IF(F6>0,IF(F6<700,\"⇓⇓⇓⇓\",\"\"),\"\")","v":"⇓⇓⇓⇓"},{"$f":"IF(F6>0,IF(F6>=700,\"⇓⇓⇓⇓\",\"\"),\"\")","v":""}]
[null,null,"date","N°de Pièce","Ref Bancaire","N°de compte","Libellé","Destinataire , Provenance , Objet","débit","crédit",null,null,{"$f":"IF(F6=0,\"ERREUR N° de compte non saisi\",\"\")","v":""}]
[]
[]
[null,null,{"$f":"TODAY()","v":"2014-01-21"},null,null,{"$f":"INDEX(comptes!B2:B37,LOOKUP(comptes!C1,comptes!A2:A37))","v":678}]
[{"$nulls":8},"…..€","…..€"]
[]
{"$rows_left_out":22}
{"sheet":"Point","index":4,"n_rows":11,"n_cols":4,"rows_kept":11,"hidden":true,"merged":[[5,3,5,4]]}
[null,"Situation au",{"$f":"TODAY()","v":"2014-01-21"}]
[null,"Solde du compte courant  donné par l'ordinateur ",{"$f":"Banque!D16","v":{"v":0,"d":"0.00 €"}}]
[null,"Solde des opérations pointées",{"$f":"ROUND(Banque!J6+Banque!M37-Banque!L37,2)","v":{"v":0,"d":"0.00 €"}}]
[null,"Inscrire dans la case jaune le solde  du compte courant donné par le relevé bancaire ",{"v":0,"d":"0.00 €"}]
[null,null,{"$f":"IF(C3-C4=0,\"BRAVO !\",\"\")","v":"BRAVO !"}]
[null,null,{"$f":"IF(C4-C3=0,\"\",\"ERREUR ! la différence à rechercher est de :\")","v":""},{"$f":"IF(C3-C4=0,\"\",ABS(C3-C4))","v":""}]
[]
[null,"Solde de la caisse ",{"$f":"Caisse!H3","v":{"v":0,"d":"0.00 €"}}]
{"$rows_left_out":4}
{"sheet":"GrilleDesComptes","index":5,"n_rows":23,"n_cols":35,"rows_kept":23,"hidden":true}
[]
[{"$nulls":3},606,607,613,615,616,618,622,623,624,625,626,627,651,657,658,671,678,null,null,741,744,746,747,748,756,758,763,771,778]
[{"$nulls":3},"Fournitures administratives","Matériel et gros équipement","Location salle ou matériel","Entretien et réparation matériel","Assurance","Documentations brochures","Prestations de service Honoraires","Récompenses Cadeaux","Transport collectif des élèves","Déplacement animateurs,  réceptions","Frais postaux et télécommunication","Frais bancaires","Sacem","Subvention versée par l'AS","Licences UNSS  Affiliation","Charges sur Tombola , calendriers","Autres charges exceptionnelles",null,null,"Collectivités territoriales","CNDS","UNSS DN SR SD74 District , crédits animation","Etablissement scolaire","Dons divers","Cotisations élèves, licences ","Participations élèves aux sorties ou activités ","Intérêts livret","Ventes tombola , calendriers…","Autres produits exceptionnels"]
[]
[null,null,{"v":0,"d":"0.00"},{"$f":"IF(Banque!$E19=D$2,Banque!$I19+Banque!$H19,0)","v":{"v":0,"d":"0.00"}},{"$f":"IF(Banque!$E19=E$2,Banque!$I19+Banque!$H19,0)","v":{"v":0,"d":"0.00"}},{"$f":"IF(Banque!$E19=F$2,Banque!$I19+Banque!$H19,0)","v":{"v":0,"d":"0.00"}},{"$f":"IF(Banque!$E19=G$2,Banque!$I19+Banque!$H19,0)","v":{"v":0,"d":"0.00"}},{"$f":"IF(Banque!$E19=H$2,Banque!$I19+Banque!$H19,0)","v":{"v":0,"d":"0.00"}},{"$f":"IF(Banque!$E19=I$2,Banque!$I19+Banque!$H19,0)","v":{"v":0,"d":"0.00"}},{"$f":"IF(Banque!$E19=J$2,Banque!$I19+Banque!$H19,0)","v":{"v":0,"d":"0.00"}},{"$f":"IF(Banque!$E19=K$2,Banque!$I19+Banque!$H19,0)","v":{"v":0,"d":"0.00"}},{"$f":"IF(Banque!$E19=L$2,Banque!$I19+Banque!$H19,0)","v":{"v":0,"d":"0.00"}},{"$f":"IF(Banque!$E19=M$2,Banque!$I19+Banque!$H19,0)","v":{"v":0,"d":"0.00"}},{"$f":"IF(Banque!$E19=N$2,Banque!$I19+Banque!$H19,0)","v":{"v":0,"d":"0.00"}},{"$f":"IF(Banque!$E19=O$2,Banque!$I19+Banque!$H19,0)","v":{"v":0,"d":"0.00"}},{"$f":"IF(Banque!$E19=P$2,Banque!$I19+Banque!$H19,0)","v":{"v":0,"d":"0.00"}},{"$f":"IF(Banque!$E19=Q$2,Banque!$I19+Banque!$H19,0)","v":{"v":0,"d":"0.00"}},{"$f":"IF(Banque!$E19=R$2,Banque!$I19+Banque!$H19,0)","v":{"v":0,"d":"0.00"}},{"$f":"IF(Banque!$E19=S$2,Banque!$I19+Banque!$H19,0)","v":{"v":0,"d":"0.00"}},{"$f":"IF(Banque!$E19=T$2,Banque!$I19+Banque!$H19,0)","v":{"v":0,"d":"0.00"}},{"$f":"IF(Banque!$E19=U$2,Banque!$I19+Banque!$H19,0)","v":{"v":0,"d":"0.00"}},{"$f":"IF(Banque!$E19=V$2,Banque!$I19+Banque!$H19,0)","v":{"v":0,"d":"0.00"}},{"$f":"IF(Banque!$E19=W$2,Banque!$I19+Banque!$H19,0)","v":{"v":0,"d":"0.00"}},{"$f":"IF(Banque!$E19=X$2,Banque!$I19+Banque!$H19,0)","v":{"v":0,"d":"0.00"}},{"$f":"IF(Banque!$E19=Y$2,Banque!$I19+Banque!$H19,0)","v":{"v":0,"d":"0.00"}},{"$f":"IF(Banque!$E19=Z$2,Banque!$I19+Banque!$H19,0)","v":{"v":0,"d":"0.00"}},{"$f":"IF(Banque!$E19=AA$2,Banque!$I19+Banque!$H19,0)","v":{"v":0,"d":"0.00"}},{"$f":"IF(Banque!$E19=AB$2,Banque!$I19+Banque!$H19,0)","v":{"v":0,"d":"0.00"}},{"$f":"IF(Banque!$E19=AC$2,Banque!$I19+Banque!$H19,0)","v":{"v":0,"d":"0.00"}},{"$f":"IF(Banque!$E19=AD$2,Banque!$I19+Banque!$H19,0)","v":{"v":0,"d":"0.00"}},{"$f":"IF(Banque!$E19=AE$2,Banque!$I19+Banque!$H19,0)","v":{"v":0,"d":"0.00"}},{"$f":"IF(Banque!$E19=AF$2,Banque!$I19+Banque!$H19,0)","v":{"v":0,"d":"0.00"}},{"$f":"IF(Banque!$E19=AG$2,Banque!$I19+Banque!$H19,0)","v":{"v":0,"d":"0.00"}},{"$f":"IF(Banque!$E19=AH$2,Banque!$I19+Banque!$H19,0)","v":{"v":0,"d":"0.00"}},{"$f":"IF(Banque!$E19=AI$2,Banque!$I19+Banque!$H19,0)","v":{"v":0,"d":"0.00"}}]
[null,null,{"v":0,"d":"0.00"},{"$f":"IF(Banque!$E20=D$2,Banque!$I20+Banque!$H20,0)","v":{"v":0,"d":"0.00"}},{"$f":"IF(Banque!$E20=E$2,Banque!$I20+Banque!$H20,0)","v":{"v":0,"d":"0.00"}},{"$f":"IF(Banque!$E20=F$2,Banque!$I20+Banque!$H20,0)","v":{"v":0,"d":"0.00"}},{"$f":"IF(Banque!$E20=G$2,Banque!$I20+Banque!$H20,0)","v":{"v":0,"d":"0.00"}},{"$f":"IF(Banque!$E20=H$2,Banque!$I20+Banque!$H20,0)","v":{"v":0,"d":"0.00"}},{"$f":"IF(Banque!$E20=I$2,Banque!$I20+Banque!$H20,0)","v":{"v":0,"d":"0.00"}},{"$f":"IF(Banque!$E20=J$2,Banque!$I20+Banque!$H20,0)","v":{"v":0,"d":"0.00"}},{"$f":"IF(Banque!$E20=K$2,Banque!$I20+Banque!$H20,0)","v":{"v":0,"d":"0.00"}},{"$f":"IF(Banque!$E20=L$2,Banque!$I20+Banque!$H20,0)","v":{"v":0,"d":"0.00"}},{"$f":"IF(Banque!$E20=M$2,Banque!$I20+Banque!$H20,0)","v":{"v":0,"d":"0.00"}},{"$f":"IF(Banque!$E20=N$2,Banque!$I20+Banque!$H20,0)","v":{"v":0,"d":"0.00"}},{"$f":"IF(Banque!$E20=O$2,Banque!$I20+Banque!$H20,0)","v":{"v":0,"d":"0.00"}},{"$f":"IF(Banque!$E20=P$2,Banque!$I20+Banque!$H20,0)","v":{"v":0,"d":"0.00"}},{"$f":"IF(Banque!$E20=Q$2,Banque!$I20+Banque!$H20,0)","v":{"v":0,"d":"0.00"}},{"$f":"IF(Banque!$E20=R$2,Banque!$I20+Banque!$H20,0)","v":{"v":0,"d":"0.00"}},{"$f":"IF(Banque!$E20=S$2,Banque!$I20+Banque!$H20,0)","v":{"v":0,"d":"0.00"}},{"$f":"IF(Banque!$E20=T$2,Banque!$I20+Banque!$H20,0)","v":{"v":0,"d":"0.00"}},{"$f":"IF(Banque!$E20=U$2,Banque!$I20+Banque!$H20,0)","v":{"v":0,"d":"0.00"}},{"$f":"IF(Banque!$E20=V$2,Banque!$I20+Banque!$H20,0)","v":{"v":0,"d":"0.00"}},{"$f":"IF(Banque!$E20=W$2,Banque!$I20+Banque!$H20,0)","v":{"v":0,"d":"0.00"}},{"$f":"IF(Banque!$E20=X$2,Banque!$I20+Banque!$H20,0)","v":{"v":0,"d":"0.00"}},{"$f":"IF(Banque!$E20=Y$2,Banque!$I20+Banque!$H20,0)","v":{"v":0,"d":"0.00"}},{"$f":"IF(Banque!$E20=Z$2,Banque!$I20+Banque!$H20,0)","v":{"v":0,"d":"0.00"}},{"$f":"IF(Banque!$E20=AA$2,Banque!$I20+Banque!$H20,0)","v":{"v":0,"d":"0.00"}},{"$f":"IF(Banque!$E20=AB$2,Banque!$I20+Banque!$H20,0)","v":{"v":0,"d":"0.00"}},{"$f":"IF(Banque!$E20=AC$2,Banque!$I20+Banque!$H20,0)","v":{"v":0,"d":"0.00"}},{"$f":"IF(Banque!$E20=AD$2,Banque!$I20+Banque!$H20,0)","v":{"v":0,"d":"0.00"}},{"$f":"IF(Banque!$E20=AE$2,Banque!$I20+Banque!$H20,0)","v":{"v":0,"d":"0.00"}},{"$f":"IF(Banque!$E20=AF$2,Banque!$I20+Banque!$H20,0)","v":{"v":0,"d":"0.00"}},{"$f":"IF(Banque!$E20=AG$2,Banque!$I20+Banque!$H20,0)","v":{"v":0,"d":"0.00"}},{"$f":"IF(Banque!$E20=AH$2,Banque!$I20+Banque!$H20,0)","v":{"v":0,"d":"0.00"}},{"$f":"IF(Banque!$E20=AI$2,Banque!$I20+Banque!$H20,0)","v":{"v":0,"d":"0.00"}}]
[null,null,{"v":0,"d":"0.00"},{"$f":"IF(Banque!$E21=D$2,Banque!$I21+Banque!$H21,0)","v":{"v":0,"d":"0.00"}},{"$f":"IF(Banque!$E21=E$2,Banque!$I21+Banque!$H21,0)","v":{"v":0,"d":"0.00"}},{"$f":"IF(Banque!$E21=F$2,Banque!$I21+Banque!$H21,0)","v":{"v":0,"d":"0.00"}},{"$f":"IF(Banque!$E21=G$2,Banque!$I21+Banque!$H21,0)","v":{"v":0,"d":"0.00"}},{"$f":"IF(Banque!$E21=H$2,Banque!$I21+Banque!$H21,0)","v":{"v":0,"d":"0.00"}},{"$f":"IF(Banque!$E21=I$2,Banque!$I21+Banque!$H21,0)","v":{"v":0,"d":"0.00"}},{"$f":"IF(Banque!$E21=J$2,Banque!$I21+Banque!$H21,0)","v":{"v":0,"d":"0.00"}},{"$f":"IF(Banque!$E21=K$2,Banque!$I21+Banque!$H21,0)","v":{"v":0,"d":"0.00"}},{"$f":"IF(Banque!$E21=L$2,Banque!$I21+Banque!$H21,0)","v":{"v":0,"d":"0.00"}},{"$f":"IF(Banque!$E21=M$2,Banque!$I21+Banque!$H21,0)","v":{"v":0,"d":"0.00"}},{"$f":"IF(Banque!$E21=N$2,Banque!$I21+Banque!$H21,0)","v":{"v":0,"d":"0.00"}},{"$f":"IF(Banque!$E21=O$2,Banque!$I21+Banque!$H21,0)","v":{"v":0,"d":"0.00"}},{"$f":"IF(Banque!$E21=P$2,Banque!$I21+Banque!$H21,0)","v":{"v":0,"d":"0.00"}},{"$f":"IF(Banque!$E21=Q$2,Banque!$I21+Banque!$H21,0)","v":{"v":0,"d":"0.00"}},{"$f":"IF(Banque!$E21=R$2,Banque!$I21+Banque!$H21,0)","v":{"v":0,"d":"0.00"}},{"$f":"IF(Banque!$E21=S$2,Banque!$I21+Banque!$H21,0)","v":{"v":0,"d":"0.00"}},{"$f":"IF(Banque!$E21=T$2,Banque!$I21+Banque!$H21,0)","v":{"v":0,"d":"0.00"}},{"$f":"IF(Banque!$E21=U$2,Banque!$I21+Banque!$H21,0)","v":{"v":0,"d":"0.00"}},{"$f":"IF(Banque!$E21=V$2,Banque!$I21+Banque!$H21,0)","v":{"v":0,"d":"0.00"}},{"$f":"IF(Banque!$E21=W$2,Banque!$I21+Banque!$H21,0)","v":{"v":0,"d":"0.00"}},{"$f":"IF(Banque!$E21=X$2,Banque!$I21+Banque!$H21,0)","v":{"v":0,"d":"0.00"}},{"$f":"IF(Banque!$E21=Y$2,Banque!$I21+Banque!$H21,0)","v":{"v":0,"d":"0.00"}},{"$f":"IF(Banque!$E21=Z$2,Banque!$I21+Banque!$H21,0)","v":{"v":0,"d":"0.00"}},{"$f":"IF(Banque!$E21=AA$2,Banque!$I21+Banque!$H21,0)","v":{"v":0,"d":"0.00"}},{"$f":"IF(Banque!$E21=AB$2,Banque!$I21+Banque!$H21,0)","v":{"v":0,"d":"0.00"}},{"$f":"IF(Banque!$E21=AC$2,Banque!$I21+Banque!$H21,0)","v":{"v":0,"d":"0.00"}},{"$f":"IF(Banque!$E21=AD$2,Banque!$I21+Banque!$H21,0)","v":{"v":0,"d":"0.00"}},{"$f":"IF(Banque!$E21=AE$2,Banque!$I21+Banque!$H21,0)","v":{"v":0,"d":"0.00"}},{"$f":"IF(Banque!$E21=AF$2,Banque!$I21+Banque!$H21,0)","v":{"v":0,"d":"0.00"}},{"$f":"IF(Banque!$E21=AG$2,Banque!$I21+Banque!$H21,0)","v":{"v":0,"d":"0.00"}},{"$f":"IF(Banque!$E21=AH$2,Banque!$I21+Banque!$H21,0)","v":{"v":0,"d":"0.00"}},{"$f":"IF(Banque!$E21=AI$2,Banque!$I21+Banque!$H21,0)","v":{"v":0,"d":"0.00"}}]
[null,null,{"v":0,"d":"0.00"},{"$f":"IF(Banque!$E22=D$2,Banque!$I22+Banque!$H22,0)","v":{"v":0,"d":"0.00"}},{"$f":"IF(Banque!$E22=E$2,Banque!$I22+Banque!$H22,0)","v":{"v":0,"d":"0.00"}},{"$f":"IF(Banque!$E22=F$2,Banque!$I22+Banque!$H22,0)","v":{"v":0,"d":"0.00"}},{"$f":"IF(Banque!$E22=G$2,Banque!$I22+Banque!$H22,0)","v":{"v":0,"d":"0.00"}},{"$f":"IF(Banque!$E22=H$2,Banque!$I22+Banque!$H22,0)","v":{"v":0,"d":"0.00"}},{"$f":"IF(Banque!$E22=I$2,Banque!$I22+Banque!$H22,0)","v":{"v":0,"d":"0.00"}},{"$f":"IF(Banque!$E22=J$2,Banque!$I22+Banque!$H22,0)","v":{"v":0,"d":"0.00"}},{"$f":"IF(Banque!$E22=K$2,Banque!$I22+Banque!$H22,0)","v":{"v":0,"d":"0.00"}},{"$f":"IF(Banque!$E22=L$2,Banque!$I22+Banque!$H22,0)","v":{"v":0,"d":"0.00"}},{"$f":"IF(Banque!$E22=M$2,Banque!$I22+Banque!$H22,0)","v":{"v":0,"d":"0.00"}},{"$f":"IF(Banque!$E22=N$2,Banque!$I22+Banque!$H22,0)","v":{"v":0,"d":"0.00"}},{"$f":"IF(Banque!$E22=O$2,Banque!$I22+Banque!$H22,0)","v":{"v":0,"d":"0.00"}},{"$f":"IF(Banque!$E22=P$2,Banque!$I22+Banque!$H22,0)","v":{"v":0,"d":"0.00"}},{"$f":"IF(Banque!$E22=Q$2,Banque!$I22+Banque!$H22,0)","v":{"v":0,"d":"0.00"}},{"$f":"IF(Banque!$E22=R$2,Banque!$I22+Banque!$H22,0)","v":{"v":0,"d":"0.00"}},{"$f":"IF(Banque!$E22=S$2,Banque!$I22+Banque!$H22,0)","v":{"v":0,"d":"0.00"}},{"$f":"IF(Banque!$E22=T$2,Banque!$I22+Banque!$H22,0)","v":{"v":0,"d":"0.00"}},{"$f":"IF(Banque!$E22=U$2,Banque!$I22+Banque!$H22,0)","v":{"v":0,"d":"0.00"}},{"$f":"IF(Banque!$E22=V$2,Banque!$I22+Banque!$H22,0)","v":{"v":0,"d":"0.00"}},{"$f":"IF(Banque!$E22=W$2,Banque!$I22+Banque!$H22,0)","v":{"v":0,"d":"0.00"}},{"$f":"IF(Banque!$E22=X$2,Banque!$I22+Banque!$H22,0)","v":{"v":0,"d":"0.00"}},{"$f":"IF(Banque!$E22=Y$2,Banque!$I22+Banque!$H22,0)","v":{"v":0,"d":"0.00"}},{"$f":"IF(Banque!$E22=Z$2,Banque!$I22+Banque!$H22,0)","v":{"v":0,"d":"0.00"}},{"$f":"IF(Banque!$E22=AA$2,Banque!$I22+Banque!$H22,0)","v":{"v":0,"d":"0.00"}},{"$f":"IF(Banque!$E22=AB$2,Banque!$I22+Banque!$H22,0)","v":{"v":0,"d":"0.00"}},{"$f":"IF(Banque!$E22=AC$2,Banque!$I22+Banque!$H22,0)","v":{"v":0,"d":"0.00"}},{"$f":"IF(Banque!$E22=AD$2,Banque!$I22+Banque!$H22,0)","v":{"v":0,"d":"0.00"}},{"$f":"IF(Banque!$E22=AE$2,Banque!$I22+Banque!$H22,0)","v":{"v":0,"d":"0.00"}},{"$f":"IF(Banque!$E22=AF$2,Banque!$I22+Banque!$H22,0)","v":{"v":0,"d":"0.00"}},{"$f":"IF(Banque!$E22=AG$2,Banque!$I22+Banque!$H22,0)","v":{"v":0,"d":"0.00"}},{"$f":"IF(Banque!$E22=AH$2,Banque!$I22+Banque!$H22,0)","v":{"v":0,"d":"0.00"}},{"$f":"IF(Banque!$E22=AI$2,Banque!$I22+Banque!$H22,0)","v":{"v":0,"d":"0.00"}}]
{"$rows_left_out":16}
{"sheet":"comptes","index":6,"n_rows":37,"n_cols":3,"rows_kept":37,"hidden":true}
[null,null,19]
[1,null,"DEPENSES"]
[2]
[3,606,"606 Fournitures administratives"]
[4,607,"607 Matériel et gros équipement"]
[5,613,"613 Location salle ou matériel"]
[6,615,"615 Entretien et réparation matériel"]
[7,616,"616 Assurance"]
{"$rows_left_out":30}
{"sheet":"Banque","index":7,"n_rows":37,"n_cols":13,"rows_kept":37,"hidden":true,"merged":[[0,3,0,4],[0,8,0,10],[2,1,2,5],[2,9,2,10],[3,1,4,1],[3,2,4,2],[3,3,4,3],[3,4,4,4],[3,5,4,5],[3,6,4,6],[3,7,4,7],[3,8,4,8],[3,9,4,9],[3,10,5,10],[5,5,5,6],[15,1,16,2],[15,3,16,3],[15,4,16,4],[17,5,17,6]]}
[null,{"$f":"\"Compte n° \"&'Bilan-Financier'!C13","v":"Compte n° 5100"},null,{"$f":"Renseignements!C9","v":"Banque Y"},null,{"$f":"Renseignements!C10","v":"n° xxxxxxxxxxxxxxx"},null,null,"DEPENSES ET RECETTES"]
[]
[null,{"$f":"\"Association sportive : \"&Renseignements!C4&\" - \"&IF(ISBLANK(Renseignements!C5),\"\",\"BP \"&Renseignements!C5)&\" - \"&Renseignements!C6&\" - \"&Renseignements!C7&\" \"&Renseignements!C8","v":"Association sportive : College X - BP ??? - adresseX - 74- - -  VilleX"},{"$nulls":4},"Edition du ",{"$f":"NOW()","v":"2014-01-21T22:29:41.890"},"ANNEE :",{"$f":"Renseignements!C11","v":"200. / 200."}]
[null,"Date","N° Pièce","Ref bancaire","N° de compte","Libellé du compte","Destinataire , Provenance , Objet","Dépenses\n-","Recettes\n+","Solde","Pointage\nInscrire le N°\ndu bordereau"]
[]
[{"$nulls":5},"Report du solde banque du dernier bordereau de l' année antérieure",{"$nulls":3},{"$f":"Renseignements!C14","v":{"v":0,"d":"0.00 €"}},null,"dépenses pointées","recettes pointées"]
[{"$nulls":5},"Ecriture année ant. non passée en banque",{"$nulls":3},{"$f":"IF(ISBLANK(G7),\"\",J6+I7-H7)","v":""},null,{"$f":"IF(ISBLANK(K7),0,H7)","v":0},{"$f":"IF(ISBLANK(K7),0,I7)","v":0}]
[{"$nulls":5},"Ecriture année ant. non passée en banque",{"$nulls":3},{"$f":"IF(ISBLANK(G8),\"\",J7+I8-H8)","v":""},null,0,0]
{"$rows_left_out":30}
{"sheet":"Caisse","index":8,"n_rows":20,"n_cols":10,"rows_kept":20,"hidden":true,"merged":[[0,1,0,2],[0,7,0,9],[3,1,4,1],[3,2,4,2],[3,6,4,6],[3,7,4,7],[3,8,4,8],[3,9,4,9],[5,6,5,8]]}
[null,{"$f":"\"Compte n° \"&'Bilan-Financier'!C15","v":"Compte n° 530"},null,"Caisse",{"$nulls":3},"DEPENSES ET RECETTES de la CAISSE"]
[{"$nulls":7},"SOLDE  actuel de la caisse :",{"$f":"IF(H3<0,\"Erreur , solde négatif\",\"\")","v":""}]
[null,{"$f":"\"Association sportive : \"&Renseignements!C4&\" - \"&IF(ISBLANK(Renseignements!C5),\"\",\"BP \"&Renseignements!C5)&\" - \"&Renseignements!C6&\" - \"&Renseignements!C7&\" \"&Renseignements!C8","v":"Association sportive : College X - BP ??? - adresseX - 74- - -  VilleX"},{"$nulls":5},{"$f":"J16","v":{"v":0,"d":"0.00 €"}},"Edition du ",{"$f":"NOW()","v":"2014-01-21T22:29:41.890"}]
[null,"Date","N° Pièce",{"$nulls":3},"Destinataire ou provenance","Dépenses\n-","Recettes\n+","Solde"]
[]
[{"$nulls":3},"Report solde année antérieure",null,null,"reprise année précédente",null,null,{"v":0,"d":"0.00 €"}]
[{"$nulls":3},"Liquide",{"v":530,"d":"530.00€"}]
[{"$nulls":3},"Liquide",{"v":530,"d":"530.00€"}]
{"$rows_left_out":13}
{"sheet":"LivretEpargne","index":9,"n_rows":20,"n_cols":10,"rows_kept":20,"hidden":true,"merged":[[0,1,0,2],[0,7,0,9],[3,1,3,6],[4,1,5,1],[4,2,5,2],[4,3,5,3],[4,6,5,6],[4,7,5,7],[4,8,5,8],[4,9,5,9]]}
[null,{"$f":"\"Compte n° \"&'Bilan-Financier'!C14","v":"Compte n° 5110"},{"$nulls":5},"Retraits et dépôts sur livret"]
[]
[{"$nulls":7},"SOLDE actuel\ndu livret :"]
[null,{"$f":"\"Association sportive : \"&Renseignements!C4&\" - \"&IF(ISBLANK(Renseignements!C5),\"\",\"BP \"&Renseignements!C5)&\" - \"&Renseignements!C6&\" - \"&Renseignements!C7&\" \"&Renseignements!C8","v":"Association sportive : College X - BP ??? - adresseX - 74- - -  VilleX"},{"$nulls":5},{"$f":"IF(J20<0,\"ERREUR !\",J20)","v":{"v":0,"d":"0.00 €"}},"Edition du ",{"$f":"NOW()","v":"2014-01-21T22:29:41.890"}]
[null,"Date","N° Pièce ","Type de\n paiement",null,null,"Destinataire ou Provenance","Retrait\n-","dépôt\n+","Solde"]
[]
[{"$nulls":7},"reprise année antérieure",null,{"$f":"Renseignements!C15","v":{"v":0,"d":"0.00 €"}}]
[null,"2013-04-26",null,"Virement",511,null,"Livret"]
{"$rows_left_out":3}
{"sheet":"Compte-Résultat","index":10,"n_rows":59,"n_cols":13,"rows_kept":59,"hidden":true,"merged":[[1,7,1,9],[2,7,2,9],[3,7,3,9],[4,7,4,9],[5,7,5,9],[8,2,8,5],[8,6,8,9],[10,2,10,5],[10,6,10,9],[14,7,17,7],[21,3,31,3],[29,7,31,7],[32,7,33,7],[34,3,37,3],[41,3,44,3],[41,7,44,7],[51,3,54,5],[51,6,54,9],[58,3,59,9]]}
[]
[{"$nulls":7},"Association sportive"]
[{"$nulls":7},{"$f":"Renseignements!C4","v":"College X"}]
[{"$nulls":7},{"$f":"IF(ISBLANK(Renseignements!C5),\"\",\"BP \"&Renseignements!C5)","v":"BP ???"}]
[{"$nulls":7},{"$f":"Renseignements!C6","v":"adresseX"}]
[{"$nulls":7},{"$f":"Renseignements!C7&\" \"&Renseignements!C8","v":"74- - -  VilleX"}]
[]
[]
{"$rows_left_out":52}
{"sheet":"Bilan-Financier","index":11,"n_rows":23,"n_cols":9,"rows_kept":23,"merged":[[1,7,1,9],[2,7,2,9],[3,7,3,9],[4,7,4,9],[5,7,5,9],[6,3,6,5],[8,2,8,5],[8,6,8,8],[10,2,10,4],[10,6,10,8]]}
[]
[{"$nulls":7},"Association sportive :"]
[{"$nulls":7},{"$f":"Renseignements!C4","v":"College X"}]
[{"$nulls":7},{"$f":"IF(ISBLANK(Renseignements!C5),\"\",\"BP \"&Renseignements!C5)","v":"BP ???"}]
[{"$nulls":7},{"$f":"Renseignements!C6","v":"adresseX"}]
[{"$nulls":7},{"$f":"Renseignements!C7&\" \"&Renseignements!C8","v":"74- - -  VilleX"}]
[{"$nulls":3},{"$f":"IF(E17=I17,\"\",\"ERREUR !!\")","v":""}]
[]
{"$rows_left_out":15}